ID,HH,VN,A04a,A04b,REG,A13D,A13M,A13Y,A13IN,A14,A14_1,A14_2,A14_3,A14_4,A14_5,A17,A18,A19,A20,A20D,A20M,A20Y,B00H,B00M,B21H,B21M,F00H,F00M,F01A,F01B,F02,F04,F05,F06,F07,F08,F09,F10_1,F10_2,F10_3,F10_4,F10_5,F10_6,F10_7,F10_8,F10_9,F11,F12,F13,F14,F15,F16,F17_1,F17_2,F17_3,F17_4,F17_5,F17_6,F17_7,F17_8,F17_9,F17_10,F18H,F18M,G00H,G00M,G70H,G70M,C00H,C00M,C01A,C01B,C01C,C02,C04,C05,C06,C07,C08,C09,C10,C11,C12,C13,C14,C15,C16,C17,C18,C19,C20,C21,C22H,C22M,D00H,D00M,D66H,D66M,E00H,E00M,E01A,E01B,E02,E03A,E03B,E04,E05,E06,E11,E12,E13,E14,E15,E16,E17,E18,E19,E20,E21,E22,E23,E24,E25,E26,E27,E28,E29,E30,E31D,E31M,E31Y,E33H,E33M,E34,E36,E37,E38,E39,I100H,I100M,I110H,I110M,AT_ID,AT_HH,AT_VN,AT_SH,AT_SM,AT_AND,AT_ANM,AT_ANY,AT_FH,AT_FM,I200H,I200M,I208H,I208M,H00H,H00M,H01H,H01M,strata,cluster,PVO,int_date,wom_count,women_id,birth_date,wom_age,eligible_women,del_date,delivery_lapse,HHWT,WMWT,gendered_hh,CA,CB,CC,CD,CE,CF,CG,CH,CI,CJ,CK,CL,HDDS,C1617,C1819,C2021,HHS,HHS_N,HHS_N2,improved_source,improved_sanitation,soap_water,critical_handwashing,critical_handwashing_cat,critical_handwashing_all
1,1,101,1,2,2,18,3,2013,38,1,1,3,1,3,1,1, ,4,1272,25,5,2013,8,22,8,39,8,39,1,101,2,32,3,30,1,2,2,997,997,997,997,997,997,997,997,997,51,2, ,4, , ,1,2,3, , , , , , , ,8,45,8,45,8,50,8,50,1,101,13,2,1,2,2,2,2,2,2,2,2,2,8,2,1,2,1,2,1,2,8,55,8,55,9,8,9,8,1,101,2, ,1978,35,1,1,1,2,1,2,2,2,2,2,2,2,2,2,2,2,1,2,2,2,1,1,1,10,2010,9,16,2,35,160,56.6,1,9,15,9,16,1,1,101,8,45,18,3,2013,9,15,9,16,9,21,9,21,9,45,14,101,1,3/18/2013,1,102, ,35,1,10/1/2010,899,6.875,20.625,3,1,0,0,0,0,0,0,0,0,0,0,0,1,1,1,1,3,1,1,0,0,0,1,0,0
2,2,101,1,2,2,18,3,2013,38,1,1,1,1,2,1,1, ,4,1272,25,5,2013,9,50,9,55,9,55,2,101,2,32,3,25,1,2,2,997,997,997,997,997,997,997,997,997,61, , ,4, , ,1,2,3,8, , , , , , ,10,0,10,0,10,13,10,13,2,101,2,2,1,8,2,2,1,2,2,1,1,1,8,1,2, ,2, ,2, ,10,17,10,17,10,23,10,23,2,101,2, ,1993,20,1,1,1,2,1,1,2,2,2,1,2,2,1,1,1,2,1,1,2,2,1,1,14,8,2012,10,29,2,20,159,43.5,1,10,33,10,34,2,2,101,10,29,18,3,2013,10,33,10,34,10,39,10,39,11,5,14,101,1,3/18/2013,1,202, ,20,1,8/14/2012,216,6.875,6.875,3,1,0,0,0,1,0,0,1,1,1,0,1,6,0,0,0,0,0,0,0,0,0,1,0,0
3,3,101,1,2,2,18,3,2013,38,1,1,1,1,1,1,1, ,4,1272,25,5,2013,11,5,11,9,11,9,3,101,2,32,3,60,1,2,2,997,997,997,997,997,997,997,997,997,31,2, ,4, , ,1,2,8, , , , , , , ,11,13,11,13,11,26,11,26,3,101,2,2,1,2,2,2,8,2,2,1,2,2,2,1,2, ,2, ,2, ,11,29,11,29,11,33,11,33,3,101,2, , , ,1,1,1,1,1,1,1,1,1,1,2,2,1,2,2,2,1,2,2,2,1,1,5,7,2010,11,39,2,22,162,50.65,1,11,40,11,41,3,3,101,11,39,18,3,2013,11,40,11,41,11,46,11,46,12,6,14,101,1,3/18/2013,1,302, , ,1,7/5/2010,987,6.875,6.875,3,1,0,0,0,0,0,0,1,0,0,0,1,3,0,0,0,0,0,0,0,1,0,1,0,0
4,4,101,1,2,2,18,3,2013,38,1,1,2,1,2,1,1, ,4,1,24,5,2013,15,40,15,45,15,45,4,101,2,32,3,120,1,1,1,97, , , , , , , , ,61, , ,4, , ,1,2,8, , , , , , , ,16,49,15,50,16,1,16,2,4,101,4,2,1,1,2,2,2,2,2,2,2,2,2,2,1,2,1,2,1,2,16,6,16,7,16,10,16,11,4,101,5, ,1991,22,1,1,2,1,2,1,2,2,2,2,2,2,1,2,2,2,1,2,2,2,1,1,18,2,2012,16,16,5,22,160.9,46.6,1,16,21,16,24,4,4,101,16,18,18,3,2013,16,20,16,25,16,27,16,28,16,45,14,101,1,3/18/2013,1,405, ,22,1,2/18/2012,394,6.875,13.75,3,1,1,0,0,0,0,0,0,0,0,0,0,2,1,1,1,3,1,1,0,0,0,1,0,0
5,5,101,1,2,2,18,3,2013,38,1,1,2,1,2,1,1, ,4,1272,25,5,2013,16,45,16,58,16,58,5,101,2,32,3,20,1,2,2,997,997,997,997,997,997,997,997,997,61, , ,4, , ,1,2,8, , , , , , , ,17,2,17,2,17,15,17,15,5,101,2,2,1,2,2,2,2,2,2,1,2,2,8,1,1,2,1,2,1,2,17,18,17,18,17,23,17,23,5,101,9, ,1973,40,1,1,1,2,2,1,2,2,2,2,2,2,1,2,2,2,1,2,2,2,1,1,1, ,2000,17,30,9,40,153.1,46.9,1,17,31,17,32,5,5,101,17,30,18,3,2013,17,31,17,32,17,33,17,33,17,50,14,101,1,3/18/2013,1,509, ,40,1, , ,6.875,13.75,3,1,0,0,0,0,0,0,1,0,0,0,1,3,1,1,1,3,1,1,0,0,0,1,0,0
6,6,101,1,2,2,18,3,2013,38,1,1,1,1,2,1,1, ,4,1272,25,5,2013,17,28,17,33, ,33,6,101,2,32,3,72,1,2,2,997,997,997,997,997,997,997,997,997,61, , ,4, , ,1,2,8, , , , , , , ,17,37,17,37,17,43,17,43,6,101,6,2,1,2,2,2,2,2,2,1,2,2,8,1,1,2,1,2,1,2,17,46,17,47,17,52,17,52,6,101,2, ,1978,35,1,1,1,1,1,1,2,2,2,2,2,2,1,2,2,2,1,2,2,2,1,1,24,3,2012,17,58,2,35,159.5,61.15,1,18,1,18,5,6,6,101,17,58,18,3,2013,18,1,18,5,18,10,18,10,18,28,14,101,1,3/18/2013,1,602, ,35,1,3/24/2012,359,6.875,6.875,3,1,0,0,0,0,0,0,1,0,0,0,1,3,1,1,1,3,1,1,0,0,0,1,0,0
7,7,101,1,2,2,19,3,2013,38,1,1,1,1,1,1,1, ,4,1272,25,5,2013,8,10,8,20,8,20,7,101,2,32,3,72,1,2,1,99, , , , , , , , ,61, , ,4, , ,1,2,8, , , , , , , ,8,23,8,23,8,28,8,28,7,101,2,2,1,2,2,2,2,2,2,1,2,2,2,1,1,2,1,2,1,2,8,35,8,35,8,38,8,38,7,101,2, ,1978,35,1,1,1,2,2,1,2,2,2,2,2,2,1,2,2,2,1,2,2,1, , ,1, , ,8,43,2,35,157.6,56.05,1,8,49,8,50,7,7,101,8,43,19,3,2013,8,49,8,50,8,51,8,51,9,21,14,101,1,3/19/2013,1,702, ,35,1, , ,6.875,6.875,3,1,0,0,0,0,0,0,1,0,0,0,1,3,1,1,1,3,1,1,0,0,0,1,0,0
8,8,101,1,2,2,19,3,2013,38,1,1,2,1,1,1,1, ,4,1272,25,5,2013,9,21,9,26,9,26,8,101,1,32,3,90,1,2,1,99, , , , , , , , ,61, , ,4, , ,1,2, , , , , , , , ,9,30,9,30,9,36,9,36,8,101,4,2,1,2,2,2,2,2,2,1,2,2,8,1,1,2,1,2,1,2,9,40,9,40,9,43,9,43,8,101,4, ,1994,19,1,1,1,1,1,1,2,2,2,1,1,2,1,2,1,2,1,2,2,1, , ,1, , ,9,48,4,19,161.9,53.5,1,9,49,9,50,8,8,101,9,48,19,3,2013,9,49,9,50,9,52,9,52,10,11,14,101,1,3/19/2013,1,804, ,19,1, , ,6.875,13.75,3,1,0,0,0,0,0,0,1,0,0,0,1,3,1,1,1,3,1,1,0,0,0,1,0,0
9,9,101,1,2,2,18,3,2013,36,1,1,1,1,1,1,1, ,4,1272,25,5,2013,8,30,8,31,8,31,9,101,1,32,3,30,1,1,2,997,997,997,997,997,997,997,997,997,22,2, ,1,1,1,1,2,3, , , , , , , ,8,32,8,32,8,44,8,44,9,101,2,2,1,2,2,2,2,2,2,2,2,2,2,2,1,3,1,3,1,3,8,47,8,47,8,55,8,55,9,101,2, ,1995,18,1,1,1,2,2,2,2,2,2,2,2,2,2,2,2,2,2,2,2,2,1,1,5,4,2012,8,59,2,18,156.4,48.5,1,9,1,9,2,9,9,101,8,59,18,3,2013,9,1,9,2,9,4,9,4,9,24,14,101,1,3/18/2013,1,902, ,18,1,4/5/2012,347,6.875,6.875,3,1,0,0,0,0,0,0,0,0,0,0,0,1,2,2,2,6,1,2,0,1,1,1,0,0
10,10,101,1,2,2,18,3,2013,36,1,1,2,1,0,1,1, ,4,1272,25,5,2013,9,40,9,45,9,45,10,101,1,32,3,60,1,1,2,997,997,997,997,997,997,997,997,997,22,2, ,1,1,1,1,2,3, , , , , , , ,9,48,9,48,10,4,10,4,10,101,1,2,1,2,2,2,2,2,2,2,2,2,2,2,1,3,1,3,1,3,10,5,10,9,10,11,10,11,10,101,5, ,1996,47,1,1,1,2,2,2,2,2,2,2,2,2,2,2,2,2,2,2,2,2,1,1,1, ,2007,10,14,5,47,162.3,58.05,1, , ,10,15,10,10,101,10,14,19,3,2013,10,15,10,16,10,17,10,17,10,41,14,101,1,3/18/2013,1,1005, ,47,1, , ,6.875,13.75,3,1,0,0,0,0,0,0,0,0,0,0,0,1,2,2,2,6,1,2,0,1,1,1,0,0
11,11,101,1,2,2,18,3,2013,36,1,1,1,1,2,1,1, ,4,1,7,5,2013,10,32,10,57,11,8,11,101,1,32,3,30,1,1,1,2, , , , , , , , ,22,1,5,1,1,1,1,2,3, , , , , , , ,11,11,11,12,11,27,11,27,11,101,2,2,1,2,2,2,2,2,2,2,2,2,2,2,1,2,1,2,1,2,11,29,11,30,11,40,11,41,11,101,2, ,1988,25,1,1,1,2,2,1,2,2,2,2,2,2,2,2,2,2,2,2,2,1, , ,1, , ,11,44,2,25,154.7,50.65,1,11,45,11,47,11,11,101,12,0,18,3,2013,12,7,11,47,11,49,11,40,12,18,14,101,1,3/18/2013,1,1102, ,25,1, , ,6.875,6.875,3,1,0,0,0,0,0,0,0,0,0,0,0,1,1,1,1,3,1,1,0,0,1,1,0,0
12,12,101,1,2,2,18,3,2013,36,1,1,1,1,3,1,1, ,4,1,8,5,2013,16,30,16,34,16,34,12,101,1,32,3,60,1,1,1,2, , , , , , , , ,22,2, ,2, , ,1,2,3, , , , , , , ,16,46,16,46,17,55,17,55,12,101,2,2,1,2,2,2,2,2,2,2,2,2,2,2,1,3,1,3,1,3,17,57,12,4,17,16,17,17,12,101,4, ,1984,29,1,1,1,2,2,2,2,2,2,2,2,2,2,2,2,2,2,2,2,2,1,1,18,8,2012,17,21,4,29,156,48.25,1,17,21,17,23,12,12,101,16,25,18,3,2013,16,40,17,23,17,25,17,25,17,40,14,101,1,3/18/2013,1,1204, ,29,1,8/18/2012,212,6.875,6.875,3,1,0,0,0,0,0,0,0,0,0,0,0,1,2,2,2,6,1,2,0,1,0,1,0,0
13,13,101,1,2,2,18,3,2013,36,1,1,1,1,2,1,1, ,4,1,6,5,2013,18,0,18,1,18,1,13,101,13,32,3,30,1,1,1,2, , , , , , , , ,22,2, ,1,1,1,1,2,3, , , , , , , ,18,2,18,3,18,13,18,13,13,101,1,2,1,2,2,2,2,2,2,2,2,2,2,2,1,2,1,2,1,2,18,19,18,14,18,21,18,21,13,101,2, ,1964,49,1,1,1,2,2,1,2,2,2,2,2,2,2,2,2,2,2,2,2,2,2, ,1, , ,18,22,2,49,164.8,58.35,1,18,21,18,22,13,13,101,18,25,18,3,2013,18,27,18,22,18,23,18,23,18,29,14,101,1,3/18/2013,1,1302, ,49,1, , ,6.875,6.875,3,1,0,0,0,0,0,0,0,0,0,0,0,1,1,1,1,3,1,1,0,1,1,1,0,0
14,14,101,1,2,2,19,3,2013,36,1,1,1,1,1,1,1, ,4,1,6,5,2013,9,28,9,29,9,29,14,101,1,32,3,30,1,1,1,97, , , , , , , , ,22,2, ,1,1,1,1,2,3, , , , , , , ,9,32,9,32,9,41,9,41,14,101,2,2,1,2,2,2,2,2,2,2,2,2,2,2,1,3,1,3,1,3,9,43,9,43,9,46,9,46,14,101,2, ,1988,25,1,1,1,2,2,2,2,2,2,2,2,2,2,2,2,2,1,2,2,1, , ,1, , ,9,48,2,25,147.9,46.9,1,9,50,9,51,14,14,101,9,35,19,3,2013,9,38,9,52,9,53,9,53,11,30,14,101,1,3/19/2013,1,1402, ,25,1, , ,6.875,6.875,3,1,0,0,0,0,0,0,0,0,0,0,0,1,2,2,2,6,1,2,0,1,1,1,0,0
15,15,101,1,2,2,19,3,2013,36,1,1,1,1,1,1,1, ,4,1,6,5,2013,10,34,10,40,10,4,15,101,1,32,3,15,1,1,1,2, , , , , , , , ,22,2, ,1,1,1,1,2,3, , , , , , , ,10,43,10,43,10,49,10,49,15,101,1,2,2,2,2,2,2,2,2,2,2,2,2,2,1,2,1,2,1,2,10,51,10,52,11,2,11,2,15,101,1, ,1978,35,1,1,2,2,2,2,2,2,2,2,2,2,2,2,2,2,2,2,2,2,1,1,1,5,2011,11,5,1,35,151.2,54.8,1,11,6,11,8,15,15,101,10,40,19,3,2013,10,43,11,8,11,12,11,12,11,26,14,101,1,3/19/2013,1,1501, ,35,1,5/1/2011,688,6.875,6.875,1,0,0,0,0,0,0,0,0,0,0,0,0,0,1,1,1,3,1,1,0,1,1,1,0,0
16,16,101,1,2,2,19,3,2013,36,1,1,2,1,1,1,1, ,4,1,6,5,2013,12,5,12,20,12,20,16,101,1,32,3,60,1,1,1,2, , , , , , , , ,21,2, ,1,1,1,1,2,3, , , , , , , ,12,28,12,28,12,33,12,34,16,101,2,2,1,2,2,2,2,2,2,2,2,2,2,2,1,1,1,1,1,1,12,35,12,35,12,45,12,48,16,101,6, ,1988,25,1,1,1,1,2,1,2,2,2,2,2,1,2,2,2,2,2,2,2,2,1,1,9,8,2011,12,51,6,25,159,64.85,1,12,52,12,53,16,16,101,12,25,19,3,2013,12,28,12,53,12,55,12,55,13,19,14,101,1,3/19/2013,1,1606, ,25,1,8/9/2011,588,6.875,13.75,3,1,0,0,0,0,0,0,0,0,0,0,0,1,1,1,1,3,1,1,0,1,1,1,0,0
17,17,101,1,2,2,18,3,2013,37,1,1,2,1,1,1,1, ,4,1,6,5,2013,8,0,8,33,8,35,17,101,1,32,3,20,2,2,2,997,997,997,997,997,997,997,997,997,61, , ,2, , ,1,2,3, , , , , , , ,8,36,8,36,8,41,8,41,17,101,1,2,1,2,2,2,2,2,2,2,2,2,2,2,1,2,1,1,1,1,8,42,8,43,8,45,8,47,17,101,1, ,1964,49,1,1,1,2,2,1,2,1,2,2,2,2,2,2,2,2,2,2,2,2,1,1,1, ,1996,8,50,1,49,160.1,48.25,1,8,50,8,51,17,17,101,8,38,18,3,2013,8,42,8,50,8,52,8,52,9,30,14,101,1,3/18/2013,1,1701, ,49,1, , ,6.875,13.75,1,1,0,0,0,0,0,0,0,0,0,0,0,1,1,1,1,3,1,1,0,0,0,1,0,0
18,18,101,1,2,2,18,3,2013,37,1,1,1,1,2,1,1, ,4,4,6,5,2013,9,35,9,44,9,44,18,101,1,32,3,45,2,2,2,997,997,997,997,997,997,997,997,997,61, , ,1,1,3,1,2,3, , , , , , , ,9,47,9,46,9,52,9,55,18,101,1,2,1,2,1,2,2,2,2,2,2,2,1,1,2, ,2, ,2, ,9,57,9,57,9,59,9,59,18,101,2, ,1991,22,1,1,1,2,2,1,2,1,2,2,2,2,2,2,2,2,1,2,1,2,1,1,2,5,2010,10,2,2,22,155.1,54.9,1,10,2,10,3,18,18,101,9,45,18,3,2013,9,53,10,3,10,4,10,5,10,30,14,101,1,3/18/2013,1,1802, ,22,1,5/2/2010,1051,6.875,6.875,3,1,0,1,0,0,0,0,0,0,0,1,1,4,0,0,0,0,0,0,0,0,0,1,0,0
19,19,101,1,2,2,18,3,2013,37,1,1,1,1,2,1,1, ,4,1,6,5,2013,10,15,10,30,10,30,19,101,1,32,3,45,2,2,2,997,997,997,997,997,997,997,997,997,61, , ,1,1,1,1,2,3, , , , , , , ,10,32,10,32,10,41,10,41,19,101,1,2,1,2,2,2,2,2,2,2,2,2,2,2,2, ,2, ,2, ,10,44,10,45,10,46,10,46,19,101,2, ,1992,21,1,1,1,1,2,2,2,2,2,2,2,2,2,2,2,2,2,2,1,2,1,1,11,3,2013,10,48,2,21,166,48.8,1,10,49,10,50,19,19,101,10,34,18,3,2013,10,39,10,50,10,51,10,51,11,30,14,101,1,3/18/2013,1,1902, ,21,1,3/11/2013,7,6.875,6.875,3,1,0,0,0,0,0,0,0,0,0,0,0,1,0,0,0,0,0,0,0,0,1,1,0,0
20,20,101,1,2,2,20,3,2013,37,1,1,1,1,0,1,1, ,1,1,6,5,2013,11,29,11,40,11,40,20,101,1,32,3,45,2,2,2,997,997,997,997,997,997,997,997,997,61, , ,3, , ,1,2,3, , , , , , , ,11,43,11,43,11,47,11,48,20,101,1,2,1,1,2,2,2,2,2,2,2,2,2,2,2, ,1,2,1,2,11,49,11,49,11,50,11,52,20,101,2, ,1964,49,1,1,1,1,2,2,2,2,2,2,2,2,2,2,2,2,2,2,2,2,1,1,1, ,1995,11,55,2,49,151.4,52.25,1, , ,11,56,20,20,101,11,45,18,3,2013,11,48,11,56,11,58,12,0,12,35,14,101,1,3/20/2013,1,2002, ,49,1, , ,6.875,6.875,3,1,1,0,0,0,0,0,0,0,0,0,0,2,0,1,1,2,1,1,0,0, ,1,0,0
21,21,101,1,2,2,18,3,2013,37,1,1,2,1,2,1,1, ,4,1,6,5,2013,15,0,15,30,15,30,21,101,1,32,3,45,2,1,1,2, , , , , , , , ,61, , ,2, , ,1,2,3, , , , , , , ,15,35,15,35,15,40,15,40,21,101,1,2,1,1,1,2,2,2,2,2,2,2,2,2,2, ,2, ,2, ,15,43,15,46,15,50,15,52,21,101,2, ,1988,25,1,1,1,2,2,2,2,1,2,2,2,2,2,2,2,2,2,2,1,1, , ,1, , ,15,55,2,25,156.2,59.15,1,15,55,15,56,21,21,101,15,35,18,3,2013,15,40,15,57,16,0,16,0,16,30,14,101,1,3/18/2013,1,2102, ,25,1, , ,6.875,20.625,1,1,1,1,0,0,0,0,0,0,0,0,0,3,0,0,0,0,0,0,0,0,0,1,0,0
22,22,101,1,2,2,18,3,2013,37,1,1,1,1,1,1,1, ,4,1,6,5,2013,16,32,16,46,16,46,22,101,1,32,3,40,2,1,2,997,997,997,997,997,997,997,997,997,61, , ,2, , ,1,2,3, , , , , , , ,16,47,16,47,16,52,16,52,22,101,1,2,1,1,1,2,2,2,2,2,2,2,2,2,2, ,2, ,2, ,16,54,16,54,16,55,16,56,22,101,2, ,1976,37,1,1,1,1,2,2,2,1,2,2,1,2,2,1,2,1,2,1,2,1, , ,1, , ,16,59,2,37,152.6,60.35,1,16,59,17,0,22,22,101,17,10,18,3,2013,17,15,17,0,17,1,17,3,17,30,14,101,1,3/18/2013,1,2202, ,37,1, , ,6.875,6.875,3,1,1,1,0,0,0,0,0,0,0,0,0,3,0,0,0,0,0,0,0,0,0,1,0,0
23,23,353,7,4,1,3,3,2013,221,1,1,1,0,2,1,16, ,3,1,11,5,2013,8,16,8,29,8,29,23,353,1,32,3,15,1,1,1,2, , , , , , , , ,61, , ,1,1,1,1,2,4,8, , , , , , ,8,34, , , , ,8,34,23,353,2,2,1,2,2,2,1,2,1,2,2,1,2,2,2, ,2, ,2, ,8,42,8,42,8,57,8,57,23,353,2, ,1983,30,1,1,1,2,2,1,2,2,2,1,2,1,2,2,1,2,1,2,2,1, , ,1, , ,9,13,2,30,158.2,53.75,1,9,13,9,19,23,23,353,9,13,18,3,2013,10,14,9,19,9,25,9,26,10,5,1,353,3,3/3/2013,1,2302, ,30,1, , ,15.625,15.625,3,1,0,0,0,1,0,1,0,0,1,0,0,4,0,0,0,0,0,0,0,0,1,2,0,0
24,24,101,1,2,2,18,3,2013,37,1,1,1,1,2,1,1, ,4,1,6,5,2013,8,0,8,20,8,20,24,101,1,32,3,45,2,1,1,2, , , , , , , , ,61, , ,2, , ,1,2,3, , , , , , , ,8,25,8,25,8,31,8,32,24,101,2,2,1,2,2,2,2,2,2,2,2,2,2,2,2, ,1,1,1,1,8,35,8,37,8,41,8,44,24,101,2, ,1988,25,1,1,1,2,2,2,2,2,2,2,2,2,2,2,2,2,2,2,2,2,1,1,19,5,2012,8,50,2,25,161.2,48.25,1,8,51,8,55,24,24,101,8,25,18,3,2013,8,32,8,55,8,59,9,0,9,39,14,101,1,3/18/2013,1,2402, ,25,1,5/19/2012,303,6.875,6.875,3,1,0,0,0,0,0,0,0,0,0,0,0,1,0,1,1,2,1,1,0,0,0,1,0,0
25,25,101,1,2,2,18,3,2013,39,1,2,2,1,4,2,1, ,4,1,6,5,2013,8,24,8,45,8,45,25,101,2,32,3,55,1,1,1,2, , , , , , , , ,61, , ,2, , ,3, , , , , , , , , ,8,52,8,52,9,1,9,1,25,101,2,2,1,2,2,2,1,2,2,1,1,2,2,2,1,1,1,1,1,1,9,10,9,7,9,21,9,21,25,101,2, ,1987,26,1,1,1,2,2,1,2,2,2,1,2,2,1,2,2,2,2,2,2,2,1,1,1,7,2012,9,24,5,26,153.6,47.85,1,9,24,9,27,25,25,101,9,10,18,3,2013,9,20,9,27,9,31,9,31,10,4,14,101,1,3/18/2013,1,2502, ,26,1,7/1/2012,260,6.875,13.75,3,1,0,0,0,1,0,0,1,1,0,0,0,4,1,1,1,3,1,1,0,0,0,0,0,0
26,26,101,1,2,2,18,3,2013,39,1,1,3,2,4,2,1, ,4,1,8,5,2013,10,19,10,45,10,45,26,101,2,32,3,36,1,1,1,2, , , , , , , , ,61, , ,2, , ,3,8, , , , , , , , ,10,50,10,50,11,1,11,1,26,101,2,2,1,2,2,2,2,2,2,1,2,2,2,2,1,3,1,3,1,3,11,12,10,45,12,30,12,24,26,101,16, ,1993,20,1,1,1,2,2,2,2,2,2,2,2,2,2,2,2,2,2,2,2,2,1,1,1, ,2012,11,20,16,20,158.3,55.15,1,11,20,11,21,26,26,101,10,50,18,3,2013,10,59,11,21,11,25,11,25,11,55,14,101,1,3/18/2013,1,2616, ,20,1, , ,6.875,20.625,3,1,0,0,0,0,0,0,1,0,0,0,0,2,2,2,2,6,1,2,0,0,0,0,0,0
27,27,101,1,2,2,18,3,2013,39,1,1,1,1,0,1,1, ,4,1,7,5,2013,12,3,12,16,12,6,27,101,2,32,3,45,1,1,1,2, , , , , , , , ,61, , ,2, , ,1,2, , , , , , , , ,12,12,10,50,12,24,12,24,27,101,2,2,1,2,2,2,2,2,2,2,2,2,2,2,1,3,1,3,1,3,12,29,11,6,11,14,12,30,27,101,2, ,1995,18,1,1,1,2,2,2,2,2,2,2,2,2,2,2,2,2,2,2,2,1, , ,1, , ,12,32,2,18,159.4,56,1, , ,12,33,27,27,101,12,20,18,3,2013,12,22,12,33,12,34,12,35,12,55,14,101,1,3/18/2013,1,2702, ,18,1, , ,6.875,6.875,3,1,0,0,0,0,0,0,0,0,0,0,0,1,2,2,2,6,1,2,0,0,0,1,0,0
28,28,101,1,2,2,18,3,2013,39,1,1,1,1,2,3,1, ,4,1,7,5,2013,15,50,16,15,16,15,28,101,2,32,3,36,1,1,2,997,997,997,997,997,997,997,997,997,61, , ,2, , ,8, , , , , , , , , ,16,22,16,22,16,35,16,35,28,101,8,2,1,2,2,2,2,2,2,2,2,2,2,2,1,2,1,1,1,1,16,42,16,42,16,50,16,50,28,101,8, ,1983,30,1,1,1,2,2,2,2,2,2,2,2,2,2,2,2,2,2,2,2,2,1,1,1,8,2012,16,53,8,30,155.1,45.55,1,16,53,16,59,28,28,101,16,17,18,3,2013,16,21,16,59,17,3,17,4,17,33,14,101,1,3/18/2013,1,2808, ,30,1,8/1/2012,229,6.875,6.875,3,1,0,0,0,0,0,0,0,0,0,0,0,1,1,1,1,3,1,1,0,0,0,0,0,0
29,29,101,1,2,2,18,3,2013,39,1,1,1,1,2,1,1, ,4,1,7,5,2013,17,45,17,59,17,59,29,101,1,32,3,38,2,2,2,997,997,997,997,997,997,997,997,997,61, , ,2, , ,3,8, , , , , , , , ,18,3,18,3,18,15,18,15,29,101,2,2,1,1,2,2,2,2,2,1,2,2,2,2,1,3,1,3,1,3,18,19, , ,18,22,18,22,29,101,2, ,1988,25,1,1,1,1,2,1,2,2,2,2,2,2,2,2,2,2,2,2,2,2,1,1,1,11,2011,18,26,2,25,158.1,49.65,1,18,26,18,28,29,29,101,18,0,18,3,2013,18,4,18,28,18,32,18,32,18,46,14,101,1,3/18/2013,1,2902, ,25,1,11/1/2011,503,6.875,6.875,3,1,1,0,0,0,0,0,1,0,0,0,0,3,2,2,2,6,1,2,0,0,0,0,0,0
30,30,101,1,2,2,19,3,2013,39,1,1,1,2,2,2,1, ,4,1,7,5,2013,8,15,8,30,8,30,30,101,2,32,3,30,1,1,1,2, , , , , , , , ,61, , ,2, , ,1,2,3,4,6,7, , , , ,8,34,8,34,8,47,8,47,30,101,2,2,1,2,2,2,2,2,2,1,2,2,2,2,2, ,2, ,2, ,8,50,8,50,8,57,8,57,30,101,2, ,1988,25,1,1,1,2,2,1,2,1,2,2,2,2,2,2,2,2,2,2,2,2,1,1,1,10,2012,8,59,2,25,157.7,53.7,1,8,59,9,1,30,30,101,8,30,19,3,2013,8,35,9,1,9,4,9,5,9,30,14,101,1,3/19/2013,1,3002, ,25,1,10/1/2012,169,6.875,6.875,3,1,0,0,0,0,0,0,1,0,0,0,0,2,0,0,0,0,0,0,0,0,0,4,1,0
31,31,101,1,2,2,19,3,2013,39,1,1,1,1,2,1,1, ,4,1,7,5,2013,9,37,9,54,9,54,31,101,1,32,3,43,1,1,1,2, , , , , , , , ,61, , ,2, , ,1,2,3,7,8, , , , , ,9,59,9,59,10,10,10,11,31,101,2,2,1,1,2,2,2,2,2,1,2,2,2,2,1,2,1,3,1,1,10,15,10,11,10,21,10,21,31,101,2, ,1983,30,1,1,1,2,1,1,2,2,2,2,2,2,1,2,2,2,2,2,2,2,1,1,1,12,2011,10,24,2,49,158.7,50.2,1,10,24,10,26,31,31,101,9,56,19,3,2013,10,1,10,26,10,29,10,29,10,58,14,101,1,3/19/2013,1,3102, ,30,1,12/1/2011,474,6.875,6.875,1,1,1,0,0,0,0,0,1,0,0,0,0,3,1,2,1,4,1,2,0,0,0,2,0,0
32,32,101,1,2,2,19,3,2013,39,1,1,2,1,3,1,1, ,4,1,8,5,2013,11,15,11,32,11,32,32,101,2,32,3,60,1,1,1,2, , , , , , , , ,61, , ,2, , ,1,2,8, , , , , , , ,11,40,11,40,11,50,11,50,32,101,2,2,1,2,2,2,2,2,2,1,2,2,2,2,2, ,2, ,2, ,11,54,11,54,12,2,12,2,32,101,8, ,1973,40,1,1,1,2,2,1,2,2,2,2,2,2,1,2,2,2,2,2,2,1, , ,1, , ,12,5,8,40,164.5,59.8,1,12,5,12,8,32,32,101,12,0,19,3,2013,12,5,12,8,12,14,12,14,12,53,14,101,1,3/19/2013,1,3208, ,40,1, , ,6.875,13.75,3,1,0,0,0,0,0,0,1,0,0,0,0,2,0,0,0,0,0,0,0,0,0,1,0,0
33,33,101,1,2,2,19,3,2013,39,1,1,1,1,2,1,1, ,4,1,7,5,2013,8,48,9,6,9,7,33,101,1,32,3,60,2,1,1,2, , , , , , , , ,61, , ,1,1,3,1,2,3, , , , , , , ,9,10,9,10,9,17,9,17,33,101,1,2,1,2,2,2,2,2,2,2,1,2,2,2,1,1,2, ,2, ,9,20,9,20,9,28,9,30,33,101,2, ,1980,33,1,1,1,2,2,2,2,2,2,2,2,2,2,2,2,2,2,2,2,1, , ,1, , ,9,33,2,33,150.4,42.85,1,9,33,9,34,33,33,101,9,15,19,3,2013,9,21,9,34,9,37,9,37,9,57,14,101,1,3/19/2013,1,3302, ,33,1, , ,6.875,6.875,3,1,0,0,0,0,0,0,0,1,0,0,0,2,1,0,0,1,0,0,0,0,0,1,0,0
34,1,102,1,2,2,16,3,2013,38,1,1,1,1,1,1,1, ,3,50,11,5,2013,8,5,8,10,8,10,1,102,2,21,3,60,1,2,1,97, , , , , , , , ,61, , ,4, , ,1,2, , , , , , , , ,8,15,8,15,8,16,8,16,1,102,2,2,1,2,2,2,2,2,2,1,1,2,2,1,2, ,2, ,2, ,8,21,8,21,8,32,8,33,1,102,2, ,1993,20,1,1,1,2,2,2,2,2,2,2,2,2,1,2,2,2,1,2,2,2,1,1,18,7,2012,8,40,2,20,158.7,56,1,8,40,8,43,34,1,102,8,15,16,3,2013,8,18,8,33,8,36,8,36,8,52,14,102,1,3/16/2013,1,3402, ,20,1,7/18/2012,241,7.58620689655173,7.58620689655173,3,1,0,0,0,0,0,0,1,1,0,0,1,4,0,0,0,0,0,0,1,0,0,1,0,0
35,2,102,1,2,2,16,3,2013,38,1,1,1,1,0,1,1, ,3,50,11,5,2013,9,2,9,7,9,7,2,102,1,21,3,45,1,2,2,997,997,997,997,997,997,997,997,997,61, , ,1,1,1,1,2,3, , , , , , , ,9,10,9,10,9,20,9,20,2,102,2,2,1,1,2,2,2,2,2,1,1,1,1,1,2, ,2, ,2, ,9,25,9,25,9,26,9,26,2,102,2, ,1995,18,1,1,1,2,1,2,2,2,2,2,2,2,1,1,1,2,1,2,2,1, , ,1, , ,9,40,2,16,156.6,56.95,1, , ,9,42,35,2,102,9,10,16,3,2013,9,12,9,42,9,46,9,46,10,12,14,102,1,3/16/2013,1,3502, ,18,1, , ,7.58620689655173,7.58620689655173,2,1,1,0,0,0,0,0,1,1,1,1,1,7,0,0,0,0,0,0,1,0,1,1,0,0
36,3,102,1,2,2,16,3,2013,38,1,1,2,1,2,1,1, ,3,50,11,5,2013,10,20,10,25,10,25,3,102,1,21,3,15,1,2,2,997,997,997,997,997,997,997,997,997,61, , ,4, , ,1,2, , , , , , , , ,10,32,10,32,10,42,10,42,3,102,1,2,1,1,2,2,1,2,2,1,1,2,1,1,2, ,2, ,2, ,10,47,11,0,11,9,10,47,3,102,2, ,1991,22,1,1,1,2,1,1,2,2,2,2,2,2,1,1,1,2,1,2,2,2,1,1,21,4,2011,10,55,2,22,149.4,38.5,1,10,55,10,59,36,3,102,10,30,16,3,2013,10,34,11,10,11,14,11,14,11,55,14,102,1,3/16/2013,1,3602, ,22,1,4/21/2011,695,7.58620689655173,15.1724137931035,3,1,1,0,0,1,0,0,1,1,0,1,1,7,0,0,0,0,0,0,1,0,0,1,0,0
37,4,102,1,2,2,16,3,2013,38,1,1,1,1,2,1,1, ,3,50,11,5,2013,16,1,16,6,16,6,4,102,2,32,3,25,1,2,2,997,997,997,997,997,997,997,997,997,61, , ,4, , ,1,2, , , , , , , , ,16,10,16,10,16,12,16,12,4,102,2,2,1,2,2,2,8,2,2,1,1,2,8,1,1,3,1,3,1,3,16,16,16,16,16,23,16,23,4,102,2, ,1982,31,1,1,1,2,2,2,2,2,2,2,2,2,2,2,2,2,2,2,2,2,1,1,1,1, ,16,26,2,31,153.4,50.4,1,16,26,16,29,37,4,102,16,10,16,3,2013,16,13,16,29,16,33,16,33,16,45,14,102,1,3/16/2013,1,3702, ,31,1, , ,7.58620689655173,7.58620689655173,3,1,0,0,0,0,0,0,1,1,0,0,1,4,2,2,2,6,1,2,0,0,0,1,0,0
39,6,102,1,2,2,17,3,2013,38,4,2,4,1,3,1,1, ,3,50,13,5,2013,17,50,18,5,18,5,6,102,1,32,3,32,1,2,2,997,997,997,997,997,997,997,997,997,61, , ,4, , ,1,2,3, , , , , , , ,18,12,7,50,7,59,8,0,6,102,2,2,1,1,2,2,1,2,2,1,1,1,1,1,1,2,1,2,1,2,8,4,8,5,8,15,8,10,6,102,8, ,1978,35,1,1,1,2,1,1,2,2,2,2,2,2,1,1,1,2,1,2,2,2,1,1,1,6,2012,8,16,8,32,158.4,46.65,1,8,16,8,20,39,6,102,8,0,16,3,2013,8,9,8,20,8,24,8,24,8,45,14,102,1,3/17/2013,1,3908, ,35,1,6/1/2012,289,7.58620689655173,30.3448275862069,3,1,1,0,0,1,0,0,1,1,1,1,1,8,1,1,1,3,1,1,0,0,0,1,0,0
41,8,102,1,2,2,17,3,2013,38,1,1,1,1,1,1,1, ,3,50,13,5,2013,10,15,10,20,10,20,8,102,2,32,3,40,1,2,2,997,997,997,997,997,997,997,997,997,61, , ,4, , ,1,2,3, , , , , , , ,10,26,10,26,10,34,10,34,8,102,2,2,1,1,2,2,2,2,2,1,2,2,8,1,1,2,1,2,1,2,10,40,10,40,10,49,10,51,8,102,2, ,1978,35,1,1,1,1,1,1,2,2,2,2,2,2,1,2,2,2,1,2,2,2,1,1,26,7,2012,10,58,2,35,160,52.2,1,10,24,11,3,41,8,102,10,20,17,3,2013,10,24,11,3,11,7,11,7,11,20,14,102,1,3/17/2013,1,4102, ,35,1,7/26/2012,234,7.58620689655173,7.58620689655173,3,1,1,0,0,0,0,0,1,0,0,0,1,4,1,1,1,3,1,1,0,0,0,1,0,0
42,9,102,1,2,2,16,3,2013,36,1,1,1,1,2,1,1, ,3,50,13,5,2013,8,38,8,54,8,58,9,102,2,21,3,30,1,1,2,997,997,997,997,997,997,997,997,997,22,2, ,1,1,1,1,2,3, , , , , , , ,9,2,9,2,9,5,9,11,9,102,2,2,2,2,2,2,2,2,2,2,2,2,2,2,1,2,1,2,1,2,9,12,9,12,9,23,9,29,9,102,2, ,1984,29,1,1,1,1,2,2,2,2,2,2,2,2,2,2,2,2,2,2,2,2,1,2,1, , ,9,33,2,29,161,54.85,1,9,27,9,29,42,9,102,9,15,16,3,2013,9,19,9,29,9,31,9,31,9,55,14,102,1,3/16/2013,1,4202, ,29,1, , ,7.58620689655173,7.58620689655173,3,0,0,0,0,0,0,0,0,0,0,0,0,0,1,1,1,3,1,1,0,1,1,1,0,0
43,10,102,1,2,2,16,3,2013,36,1,1,2,1,3,1,1, ,3,50,13,5,2013,10,20,10,37,10,57,10,102,1,32,3,26,2,2,2,997,997,997,997,997,997,997,997,997,22,2, ,1,1,1,1,2,3, , , , , , , ,11,0,11,0,11,11,11,9,10,102,2,2,1,2,2,2,2,2,2,2,2,2,2,2,2, ,2, ,2, ,11,20,11,21,11,32,11,34,10,102,7, ,1985,28,1,1,1,2,2,2,2,2,2,2,2,2,2,2,2,2,2,2,2,2,1,1,1,1,2008,11,43,7,28,158.9,46.3,1,11,44,11,46,43,10,102,10,40,16,3,2013,10,47,11,47,11,49,11,49,12,21,14,102,1,3/16/2013,1,4307, ,28,1,1/1/2008,1901,7.58620689655173,15.1724137931035,3,1,0,0,0,0,0,0,0,0,0,0,0,1,0,0,0,0,0,0,0,1,1,1,0,0
44,11,102,1,2,2,16,3,2013,36,1,1,1,1,0,1,1, ,3,50,13,5,2013,12,51,12,54,12,54,11,102,1,32,3,60,2,1,2,997,997,997,997,997,997,997,997,997,22,2, ,1,1,1,1,2,3, , , , , , , ,12,54,12,54,13,6,13,6,11,102,1,2,1,2,2,2,2,2,2,2,2,2,2,2,1,2,1,2,1,2,13,8,13,8,13,9,13,10,11,102,6, ,1996,17,1, , , , , , , , , , , , , , , , , , , , , ,1, , ,13,12,6,17, , ,2, , ,13,0,44,11,102,13,12, , ,2013,13,25,13,12,13,14,13,14,13,29,14,102,1,3/16/2013,1,4406, ,17,1, , ,7.58620689655173,7.58620689655173,2,1,0,0,0,0,0,0,0,0,0,0,0,1,1,1,1,3,1,1,0,1,1,1,0,0
46,19,274,23,1,1,24,3,2013,228,1,1,1,1,2,1,17, ,3,1,5,5,2013,18,0,18,7,18,7,19,274,1,32,3,25,1,2,1,3, , , , , , , , ,61, , ,1,1,1,1,2,6, , , , , , , ,18,10,18,10,18,16,18,16,19,274,2,2,1,1,2,2,1,2,2,1,2,1,1,1,2, ,2, ,2, ,18,19,18,18,18,25,18,26,19,274,2, ,1985,28,1,1,1,1,2,1,2,2,2,2,2,2,1,2,2,1,2,2,2,1, , ,1, , ,18,30,2,28,157.4,49.15,1,18,30,18,35,46,19,274,9,9,24,3,2013,9,18,18,35,18,36,18,36,18,46,22,274,2,3/24/2013,1,4602, ,28,1, , ,16.5143369175627,16.5143369175628,3,1,1,0,0,1,0,0,1,0,1,1,1,7,0,0,0,0,0,0,0,0,1,2,0,0
47,14,102,1,2,2,17,3,2013,36,1,1,1,1,0,1,1, ,3,50,13,5,2013,8,14,8,16,8,16,14,102,1,32,3,60,1,1,2,997,997,997,997,997,997,997,997,997,22,2, ,1,1,1,1,2,3, , , , , , , ,8,18,8,18,8,23,8,23,14,102,2,2,2,2,2,2,2,2,2,2,2,2,2,2,1,1,1,1,1,1,8,25,8,25,8,26,8,27,14,102,2, ,1997,16,1,1,2,2,2,2,2,2,2,2,2,2,2,2,2,2,2,2,2,2,2, ,1, , ,8,30,2,16,152.4,55.2,1, , ,8,31,47,14,102,8,20,17,3,2013,8,22,8,31,8,35,8,35,8,50,14,102,1,3/17/2013,1,4702, ,16,1, , ,7.58620689655173,7.58620689655173,2,0,0,0,0,0,0,0,0,0,0,0,0,0,1,1,1,3,1,1,0,1,1,1,0,0